{"text_format":"1","workbook":"xlsx","n_sheets":3,"sheets":["Eingabemaske","ÖSKB Spielbericht","Spielerkartei - Spielbericht"],"not_rendered":{"charts":0,"images":1,"macros":1,"external_links":0,"defined_names":4,"comments":0,"pivot_tables":0},"unopened":[],"bounds":{"document_bytes":16777216,"sheet_cells":100000,"rows_first":2000,"rows_last":500,"rows_between":2000,"halvings":0,"cell_chars":16384,"cell_head_chars":4096},"cells_cut":0,"cells_raw":0,"read":"whole","date_system":"1900"}

{"sheet":"Eingabemaske","index":0,"n_rows":24,"n_cols":20,"rows_kept":24,"cut":false,"hidden":false,"merged":[[4,18,4,19],[0,0,0,1],[0,4,0,5],[0,13,0,16],[1,0,1,1],[1,13,1,16],[2,0,2,1],[2,13,2,16],[4,3,4,4],[4,6,4,7],[4,8,4,9],[4,13,4,14],[4,16,4,17],[16,8,16,9],[16,18,16,19],[20,1,20,4],[22,0,22,19],[14,5,15,5],[14,6,14,7],[14,15,15,15],[14,16,14,17],[15,6,15,9],[15,16,15,19]]}
["Runde"]
["Datum"]
["Uhrzeit"]
[]
["Heimverein",null,null,"Vereinsnr.",null,null,"LV Nr.",null,null,null,"Gastverein",null,null,"Vereinsnr.",null,null,"LV Nr."]
["Passnr.","Rl.","Name","FW.","1.Satz","2.Satz","3.Satz","4.Satz","Ges.","M Lp.","Passnr.","Rl.","Name","FW.","1.Satz","2.Satz","3.Satz","4.Satz","Ges.","M Lp."]
[null,null,{"$f":"IF(A7=\"\",\"\",VLOOKUP(A7,'Spielerkartei - Spielbericht'!$A$452:$B$735,2))","v":""},null,null,null,null,null,{"$f":"IF(E7=\"\",\"\",SUM(E7:H7))","v":""},{"$f":"IF(E7=\"\",\"\",IF(I8>S8,1,IF(I8<S8,0,IF(I8=S8,IF(I7>S7,1,IF(I7=S7,0.5,))))))","v":""},null,null,{"$f":"IF(K7=\"\",\"\",VLOOKUP(K7,'Spielerkartei - Spielbericht'!$A$452:$B$735,2))","v":""},null,null,null,null,null,{"$f":"IF(O7=\"\",\"\",SUM(O7:R7))","v":""},{"$f":"IF(O7=\"\",\"\",IF(S8>I8,1,IF(S8<I8,0,IF(S8=I8,IF(S7>I7,1,IF(S7=I7,0.5,))))))","v":""}]
[null,null,null,null,{"$f":"IF(E7=\"\",\"\",IF(E7>O7,1,IF(E7=O7,0.5,0)))","v":""},{"$f":"IF(F7=\"\",\"\",IF(F7>P7,1,IF(F7=P7,0.5,0)))","v":""},"","",{"$f":"IF(E8=\"\",\"\",SUM(E8:H8))","v":""},null,null,null,null,null,{"$f":"IF(O7=\"\",\"\",IF(O7>E7,1,IF(O7=E7,0.5,0)))","v":""},{"$f":"IF(P7=\"\",\"\",IF(P7>F7,1,IF(P7=F7,0.5,0)))","v":""},{"$f":"IF(Q7=\"\",\"\",IF(Q7>G7,1,IF(Q7=G7,0.5,0)))","v":""},"",{"$f":"IF(O8=\"\",\"\",SUM(O8:R8))","v":""}]
[null,null,{"$f":"IF(A9=\"\",\"\",VLOOKUP(A9,'Spielerkartei - Spielbericht'!$A$452:$B$735,2))","v":""},null,null,null,null,null,"",{"$f":"IF(E9=\"\",\"\",IF(I10>S10,1,IF(I10<S10,0,IF(I10=S10,IF(I9>S9,1,IF(I9=S9,0.5,))))))","v":""},null,null,{"$f":"IF(K9=\"\",\"\",VLOOKUP(K9,'Spielerkartei - Spielbericht'!$A$452:$B$735,2))","v":""},null,null,null,null,null,"",{"$f":"IF(O9=\"\",\"\",IF(S10>I10,1,IF(S10<I10,0,IF(S10=I10,IF(S9>I9,1,IF(S9=I9,0.5,))))))","v":""}]
[null,null,null,null,"","","","","",null,null,null,null,null,{"$f":"IF(O9=\"\",\"\",IF(O9>E9,1,IF(O9=E9,0.5,0)))","v":""},{"$f":"IF(P9=\"\",\"\",IF(P9>F9,1,IF(P9=F9,0.5,0)))","v":""},"","",""]
[null,null,{"$f":"IF(A11=\"\",\"\",VLOOKUP(A11,'Spielerkartei - Spielbericht'!$A$452:$B$735,2))","v":""},null,null,null,null,null,"","",null,null,{"$f":"IF(K11=\"\",\"\",VLOOKUP(K11,'Spielerkartei - Spielbericht'!$A$452:$B$735,2))","v":""},null,null,null,null,null,"",""]
[null,null,null,null,"","","","","",null,null,null,null,null,{"$f":"IF(O11=\"\",\"\",IF(O11>E11,1,IF(O11=E11,0.5,0)))","v":""},{"$f":"IF(P11=\"\",\"\",IF(P11>F11,1,IF(P11=F11,0.5,0)))","v":""},"","",""]
[null,null,{"$f":"IF(A13=\"\",\"\",VLOOKUP(A13,'Spielerkartei - Spielbericht'!$A$452:$B$735,2))","v":""},null,null,null,null,null,"","",null,null,{"$f":"IF(K13=\"\",\"\",VLOOKUP(K13,'Spielerkartei - Spielbericht'!$A$452:$B$735,2))","v":""},null,null,null,null,null,"",""]
[null,null,null,null,"","","","","",null,null,null,null,null,{"$f":"IF(O13=\"\",\"\",IF(O13>E13,1,IF(O13=E13,0.5,0)))","v":""},{"$f":"IF(P13=\"\",\"\",IF(P13>F13,1,IF(P13=F13,0.5,0)))","v":""},"","",""]
[null,null,{"$f":"IF(A15=\"\",\"\",VLOOKUP(A15,'Spielerkartei - Spielbericht'!$A$452:$B$735,2))","v":""},null,null,"Wurf für","Kegel Ges.",null,{"$f":"IF(I7=\"\",\"\",SUM(I7,I9,I11,I13))","v":""},{"$f":"IF(I7=\"\",\"\",IF(I15>S15,2,IF(I15<S15,0,IF(I15=S15,1))))","v":""},null,null,{"$f":"IF(K15=\"\",\"\",VLOOKUP(K15,'Spielerkartei - Spielbericht'!$A$452:$B$735,2))","v":""},null,null,"Wurf für","Kegel Ges.",null,{"$f":"IF(S7=\"\",\"\",SUM(S7,S9,S11,S13))","v":""},{"$f":"IF(S15=\"\",\"\",IF(S15>I15,2,IF(S15<I15,0,IF(S15=I15,1))))","v":""}]
[null,null,"Ersatzspieler","ab",null,null,null,null,null,null,null,null,"Ersatzspieler","ab"]
[null,null,null,null,null,null,null,null,"Gesamt",null,null,null,null,null,null,null,null,null,"Gesamt"]
[null,null,"Fehlwurf Gesamt",{"$f":"IF(D7=\"\",\"\",SUM(D7,D9,D11,D13,D15))","v":""},null,null,null,"Kegel",{"$f":"IF(I7=\"\",\"\",SUM(I7,I9,I11,I13))","v":""},null,null,null,"Fehlwurf Gesamt",{"$f":"IF(N7=\"\",\"\",SUM(N7,N9,N11,N13,N15))","v":""},null,null,null,"Kegel",{"$f":"IF(S7=\"\",\"\",SUM(S7,S9,S11,S13))","v":""}]
[null,null,null,null,null,null,null,"Satzp.",{"$f":"IF(I8=\"\",\"\",SUM(I8,I10,I12,I14))","v":""},null,null,null,null,null,null,null,null,"Satzp.",{"$f":"IF(S8=\"\",\"\",SUM(S8,S10,S12,S14))","v":""}]
[null,null,null,null,null,null,null,"MP",{"$f":"IF(J7=\"\",\"\",SUM(J7,J9,J11,J13,J15))","v":""},null,null,null,null,null,null,null,null,"MP",{"$f":"IF(T7=\"\",\"\",SUM(T7,T9,T11,T13,T15))","v":""}]
[null,null,null,null,null,null,null,"TP",{"$f":"IF(I20=\"\",\"\",IF(I20>S20,2,IF(I20<S20,0,IF(I20=S20,1))))","v":""},null,null,null,null,null,null,null,null,"TP",{"$f":"IF(S20=\"\",\"\",IF(S20>I20,2,IF(S20<I20,0,IF(S20=I20,1))))","v":""}]
[null,"Diese Felder ausfüllen!!!!!!!!"]
["Beim ÖSKB Spielbericht müssen nur die dazu gehörenden Felder für den oder die Ersatzspieler/in, Heim und Gastverein, "]
["Sportkapitäne und Schiedsrichter eingetragen werden!!!!!!!!!"]

{"sheet":"ÖSKB Spielbericht","index":1,"n_rows":65,"n_cols":44,"rows_kept":65,"cut":false,"hidden":false,"merged":[[8,30,8,31],[9,22,9,23],[7,26,7,27],[9,15,10,15],[10,9,10,10],[9,19,9,20],[7,21,8,21],[2,17,2,19],[3,17,3,19],[2,5,2,10],[3,5,3,10],[5,11,5,13],[5,14,5,15],[6,22,6,23],[6,24,6,25],[5,17,5,21],[5,22,5,24],[10,19,10,20],[9,7,9,8],[9,13,9,14],[10,13,10,14],[9,9,9,10],[9,11,9,12],[9,30,9,31],[21,0,22,8],[18,0,19,2],[21,14,21,15],[19,6,19,7],[15,19,15,20],[8,13,8,14],[15,2,15,3],[18,4,18,5],[18,6,18,7],[15,4,16,4],[15,5,16,6],[15,10,16,15],[18,15,19,15],[13,9,13,10],[16,2,16,3],[11,19,11,20],[21,20,22,32],[15,27,16,32],[18,17,19,19],[16,19,16,20],[15,18,16,18],[21,17,21,18],[15,17,16,17],[18,23,18,24],[15,22,16,23],[14,22,14,23],[11,32,12,32],[18,32,19,32],[15,24,16,26],[15,21,16,21],[18,25,19,31],[19,21,19,22],[19,23,19,24],[12,26,12,27],[18,21,18,22],[13,21,14,21],[12,30,12,31],[14,26,14,27],[14,24,14,25],[13,32,14,32],[13,28,13,29],[14,30,14,31],[14,28,14,29],[13,30,13,31],[13,26,13,27],[13,22,13,23],[12,2,12,3],[13,2,13,3],[14,7,14,8],[13,7,13,8],[14,2,14,3],[10,30,10,31],[10,28,10,29],[11,26,11,27],[11,21,12,21],[10,24,10,25],[13,18,14,18],[13,15,14,15],[13,17,14,17],[10,2,10,3],[7,5,7,6],[8,5,8,6],[7,19,7,20],[8,19,8,20],[18,8,19,14],[13,13,13,14],[13,0,14,0],[11,1,12,1],[13,1,14,1],[13,11,13,12],[11,2,11,3],[15,0,16,0],[15,1,16,1],[19,4,19,5],[15,7,16,9],[14,9,14,10],[14,5,14,6],[11,5,11,6],[12,5,12,6],[14,11,14,12],[14,13,14,14],[14,19,14,20],[13,4,14,4],[13,5,13,6],[9,26,9,27],[7,22,7,23],[7,24,7,25],[9,21,10,21],[6,9,6,10],[8,7,8,8],[7,9,7,10],[7,11,7,12],[12,19,12,20],[10,22,10,23],[8,26,8,27],[8,24,8,25],[8,22,8,23],[11,18,12,18],[11,17,12,17],[12,11,12,12],[11,15,12,15],[11,13,11,14],[7,7,7,8],[6,7,6,8],[6,11,6,12],[7,13,7,14],[0,0,0,32],[12,7,12,8],[11,24,11,25],[9,5,9,6],[7,0,8,0],[9,0,10,0],[11,4,12,4],[11,0,12,0],[8,11,8,12],[7,30,7,31],[5,5,5,7],[5,31,5,32],[7,32,8,32],[7,15,8,15],[11,22,11,23],[7,18,8,18],[12,28,12,29],[11,28,11,29],[7,28,7,29],[9,24,9,25],[11,30,11,31],[8,28,8,29],[9,28,9,29],[10,26,10,27],[9,32,10,32],[8,9,8,10],[10,11,10,12],[6,28,6,29],[1,0,1,1],[2,0,2,1],[3,0,3,1],[1,2,1,3],[2,2,2,3],[3,2,3,3],[1,5,1,12],[2,11,2,12],[3,11,3,12],[5,8,5,10],[1,20,1,28],[2,20,2,28],[1,17,1,19],[3,20,3,28],[5,28,5,30],[5,25,5,27],[6,30,6,31],[6,19,6,20],[6,26,6,27],[6,13,6,14],[5,0,5,4],[6,2,6,3],[7,1,8,1],[9,1,10,1],[12,22,12,23],[12,24,12,25],[13,24,13,25],[13,19,13,20],[9,4,10,4],[7,2,7,3],[8,2,8,3],[9,2,9,3],[12,13,12,14],[11,7,11,8],[11,9,11,10],[11,11,11,12],[12,9,12,10],[9,18,10,18],[9,17,10,17],[10,5,10,6],[10,7,10,8],[7,4,8,4],[7,17,8,17],[6,5,6,6],[29,0,29,3],[24,20,25,32],[26,0,26,8],[27,17,28,18],[23,14,24,15],[23,0,23,8],[28,30,28,31],[23,17,24,18],[24,0,25,8],[23,20,23,32],[27,0,28,3],[27,30,27,31],[26,20,26,32],[29,6,29,8],[29,4,29,5],[29,19,29,23],[27,4,28,5],[27,6,28,8],[29,30,29,31],[28,25,28,29],[29,25,29,29],[27,14,28,15]]}
["S  P  I  E  L  B  E  R  I  C  H  T"]
["RUNDE",null,{"$f":"Eingabemaske!C1","v":0},null,null,"MEISTERSCHAFT",null,null,null,null,null,null,null,null,null,null,null,"   LIGA, KLASSE: ",null,null,{"$f":"IF($A$22=\"\",\"\",VLOOKUP($A$22,$AL$37:$AP$69,5))","v":""},null,null,null,null,null,null,null,null,null,null,null,1]
["DATUM",null,{"$f":"Eingabemaske!C2","v":"00:00:00"},null,null,"DAMEN",null,null,null,null,null,{"$f":"IF($A$22=\"\",\"\",VLOOKUP($A$22,$AL$37:$AR$69,6))","v":""},null,null,null,null,null,"   BAHN: ",null,null,{"$f":"IF($A$22=\"\",\"\",VLOOKUP($A$22,$AL$37:$AP$69,3))","v":""}]
["UHRZEIT",null,{"$f":"Eingabemaske!C3","v":"00:00:00"},null,null,"HERREN",null,null,null,null,null,{"$f":"IF($A$22=\"\",\"\",VLOOKUP($A$22,$AL$37:$AR$69,7))","v":""},null,null,null,null,null,"   ORT: ",null,null,{"$f":"IF($A$22=\"\",\"\",VLOOKUP($A$22,$AL$37:$AP$69,4))","v":""}]
[]
["HEIMVEREIN",null,null,null,null,"Vereins-Nr.",null,null,{"$f":"IF(A22=\"\",\"\",VLOOKUP(A22,AL37:AM69,2))","v":""},null,null,"LV-Nr.",null,null,{"$f":"IF(I6=\"\",\"\",18)","v":""},null,null,"GASTVEREIN",null,null,null,null,"Vereins-Nr.",null,null,{"$f":"IF(U22=\"\",\"\",VLOOKUP(U22,AL37:AM65,2))","v":""},null,null,"LV-Nr.",null,null,{"$f":"IF(U22=\"\",\"\",18)","v":""}]
["Pass-NR.","RL","NAME",null,"FW","1. Satz",null,"2. Satz",null,"3. Satz",null,"4. Satz",null,"GES",null,"M - LP",null,"Pass-NR.","RL","NAME",null,"FW","1. Satz",null,"2. Satz",null,"3. Satz",null,"4. Satz",null,"GES",null,"M - LP"]
[{"$f":"Eingabemaske!A7","v":0},null,{"$f":"IF(A8=\"\",\"\",VLOOKUP(A8,'Spielerkartei - Spielbericht'!$A$452:$B$735,2))","v":{"$error":"#N/A"}},null,{"$f":"Eingabemaske!D7","v":0},{"$f":"Eingabemaske!E7","v":0},null,{"$f":"Eingabemaske!F7","v":0},null,{"$f":"Eingabemaske!G7","v":0},null,{"$f":"Eingabemaske!H7","v":0},null,{"$f":"IF(F8=\"\",\"\",SUM(F8:M8))","v":0},null,{"$f":"IF(F8=\"\",\"\",IF(N9>AE9,1,IF(N9<AE9,0,IF(N9=AE9,IF(N8>AE8,1,IF(N8=AE8,0.5,))))))","v":0.5},null,{"$f":"Eingabemaske!K7","v":0},null,{"$f":"IF(R8=\"\",\"\",VLOOKUP(R8,'Spielerkartei - Spielbericht'!$A$452:$B$735,2))","v":{"$error":"#N/A"}},null,{"$f":"Eingabemaske!N7","v":0},{"$f":"Eingabemaske!O7","v":0},null,{"$f":"Eingabemaske!P7","v":0},null,{"$f":"Eingabemaske!Q7","v":0},null,{"$f":"Eingabemaske!R7","v":0},null,{"$f":"IF(W8=\"\",\"\",SUM(W8:AD8))","v":0},null,{"$f":"IF(W8=\"\",\"\",IF(AE9>N9,1,IF(AE9<N9,0,IF(AE9=N9,IF(AE8>N8,1,IF(AE8=N8,0.5,))))))","v":0.5}]
[null,null,null,null,null,{"$f":"IF(F8=\"\",\"\",IF(F8>W8,1,IF(F8=W8,0.5,0)))","v":0.5},null,{"$f":"IF(H8=\"\",\"\",IF(H8>Y8,1,IF(H8=Y8,0.5,0)))","v":0.5},null,{"$f":"IF(J8=\"\",\"\",IF(J8>AA8,1,IF(J8=AA8,0.5,0)))","v":0.5},null,{"$f":"IF(L8=\"\",\"\",IF(L8>AC8,1,IF(L8=AC8,0.5,0)))","v":0.5},null,{"$f":"IF(F9=\"\",\"\",SUM(F9:M9))","v":2},null,null,null,null,null,null,null,null,{"$f":"IF(W8=\"\",\"\",IF(W8>F8,1,IF(W8=F8,0.5,0)))","v":0.5},null,{"$f":"IF(Y8=\"\",\"\",IF(Y8>H8,1,IF(Y8=H8,0.5,0)))","v":0.5},null,{"$f":"IF(AA8=\"\",\"\",IF(AA8>J8,1,IF(AA8=J8,0.5,0)))","v":0.5},null,{"$f":"IF(AC8=\"\",\"\",IF(AC8>L8,1,IF(AC8=L8,0.5,0)))","v":0.5},null,{"$f":"IF(W9=\"\",\"\",SUM(W9:AD9))","v":2}]
[{"$f":"Eingabemaske!A9","v":0},null,{"$f":"IF(A10=\"\",\"\",VLOOKUP(A10,'Spielerkartei - Spielbericht'!$A$452:$B$735,2))","v":{"$error":"#N/A"}},null,{"$f":"Eingabemaske!D9","v":0},{"$f":"Eingabemaske!E9","v":0},null,{"$f":"Eingabemaske!F9","v":0},null,{"$f":"Eingabemaske!G9","v":0},null,{"$f":"Eingabemaske!H9","v":0},null,{"$f":"IF(F10=\"\",\"\",SUM(F10:M10))","v":0},null,{"$f":"IF(F10=\"\",\"\",IF(N11>AE11,1,IF(N11<AE11,0,IF(N11=AE11,IF(N10>AE10,1,IF(N10=AE10,0.5,))))))","v":0.5},null,{"$f":"Eingabemaske!K9","v":0},null,{"$f":"IF(R10=\"\",\"\",VLOOKUP(R10,'Spielerkartei - Spielbericht'!$A$452:$B$735,2))","v":{"$error":"#N/A"}},null,{"$f":"Eingabemaske!N9","v":0},{"$f":"Eingabemaske!O9","v":0},null,{"$f":"Eingabemaske!P9","v":0},null,{"$f":"Eingabemaske!Q9","v":0},null,{"$f":"Eingabemaske!R9","v":0},null,{"$f":"IF(W10=\"\",\"\",SUM(W10:AD10))","v":0},null,{"$f":"IF(W10=\"\",\"\",IF(AE11>N11,1,IF(AE11<N11,0,IF(AE11=N11,IF(AE10>N10,1,IF(AE10=N10,0.5,))))))","v":0.5}]
[null,null,null,null,null,{"$f":"IF(F10=\"\",\"\",IF(F10>W10,1,IF(F10=W10,0.5,0)))","v":0.5},null,{"$f":"IF(H10=\"\",\"\",IF(H10>Y10,1,IF(H10=Y10,0.5,0)))","v":0.5},null,{"$f":"IF(J10=\"\",\"\",IF(J10>AA10,1,IF(J10=AA10,0.5,0)))","v":0.5},null,{"$f":"IF(L10=\"\",\"\",IF(L10>AC10,1,IF(L10=AC10,0.5,0)))","v":0.5},null,2,null,null,null,null,null,null,null,null,{"$f":"IF(W10=\"\",\"\",IF(W10>F10,1,IF(W10=F10,0.5,0)))","v":0.5},null,{"$f":"IF(Y10=\"\",\"\",IF(Y10>H10,1,IF(Y10=H10,0.5,0)))","v":0.5},null,{"$f":"IF(AA10=\"\",\"\",IF(AA10>J10,1,IF(AA10=J10,0.5,0)))","v":0.5},null,{"$f":"IF(AC10=\"\",\"\",IF(AC10>L10,1,IF(AC10=L10,0.5,0)))","v":0.5},null,2]
[{"$f":"Eingabemaske!A11","v":0},null,{"$f":"IF(A12=\"\",\"\",VLOOKUP(A12,'Spielerkartei - Spielbericht'!$A$452:$B$735,2))","v":{"$error":"#N/A"}},null,{"$f":"Eingabemaske!D11","v":0},{"$f":"Eingabemaske!E11","v":0},null,{"$f":"Eingabemaske!F11","v":0},null,{"$f":"Eingabemaske!G11","v":0},null,{"$f":"Eingabemaske!H11","v":0},null,0,null,{"$f":"IF(F12=\"\",\"\",IF(N13>AE13,1,IF(N13<AE13,0,IF(N13=AE13,IF(N12>AE12,1,IF(N12=AE12,0.5,))))))","v":0.5},null,{"$f":"Eingabemaske!K11","v":0},null,{"$f":"IF(R12=\"\",\"\",VLOOKUP(R12,'Spielerkartei - Spielbericht'!$A$452:$B$735,2))","v":{"$error":"#N/A"}},null,{"$f":"Eingabemaske!N11","v":0},{"$f":"Eingabemaske!O11","v":0},null,{"$f":"Eingabemaske!P11","v":0},null,{"$f":"Eingabemaske!Q11","v":0},null,{"$f":"Eingabemaske!R11","v":0},null,{"$f":"IF(W12=\"\",\"\",SUM(W12:AD12))","v":0},null,{"$f":"IF(W12=\"\",\"\",IF(AE13>N13,1,IF(AE13<N13,0,IF(AE13=N13,IF(AE12>N12,1,IF(AE12=N12,0.5,))))))","v":0.5}]
[null,null,null,null,null,{"$f":"IF(F12=\"\",\"\",IF(F12>W12,1,IF(F12=W12,0.5,0)))","v":0.5},null,{"$f":"IF(H12=\"\",\"\",IF(H12>Y12,1,IF(H12=Y12,0.5,0)))","v":0.5},null,{"$f":"IF(J12=\"\",\"\",IF(J12>AA12,1,IF(J12=AA12,0.5,0)))","v":0.5},null,{"$f":"IF(L12=\"\",\"\",IF(L12>AC12,1,IF(L12=AC12,0.5,0)))","v":0.5},null,2,null,null,null,null,null,null,null,null,{"$f":"IF(W12=\"\",\"\",IF(W12>F12,1,IF(W12=F12,0.5,0)))","v":0.5},null,{"$f":"IF(Y12=\"\",\"\",IF(Y12>H12,1,IF(Y12=H12,0.5,0)))","v":0.5},null,{"$f":"IF(AA12=\"\",\"\",IF(AA12>J12,1,IF(AA12=J12,0.5,0)))","v":0.5},null,{"$f":"IF(AC12=\"\",\"\",IF(AC12>L12,1,IF(AC12=L12,0.5,0)))","v":0.5},null,2]
[{"$f":"Eingabemaske!A13","v":0},null,{"$f":"IF(A14=\"\",\"\",VLOOKUP(A14,'Spielerkartei - Spielbericht'!$A$452:$B$735,2))","v":{"$error":"#N/A"}},null,{"$f":"Eingabemaske!D13","v":0},{"$f":"Eingabemaske!E13","v":0},null,{"$f":"Eingabemaske!F13","v":0},null,{"$f":"Eingabemaske!G13","v":0},null,{"$f":"Eingabemaske!H13","v":0},null,0,null,{"$f":"IF(F14=\"\",\"\",IF(N15>AE15,1,IF(N15<AE15,0,IF(N15=AE15,IF(N14>AE14,1,IF(N14=AE14,0.5,))))))","v":0.5},null,{"$f":"Eingabemaske!K13","v":0},null,{"$f":"IF(R14=\"\",\"\",VLOOKUP(R14,'Spielerkartei - Spielbericht'!$A$452:$B$735,2))","v":{"$error":"#N/A"}},null,{"$f":"Eingabemaske!N13","v":0},{"$f":"Eingabemaske!O13","v":0},null,{"$f":"Eingabemaske!P13","v":0},null,{"$f":"Eingabemaske!Q13","v":0},null,{"$f":"Eingabemaske!R13","v":0},null,{"$f":"IF(W14=\"\",\"\",SUM(W14:AD14))","v":0},null,{"$f":"IF(W14=\"\",\"\",IF(AE15>N15,1,IF(AE15<N15,0,IF(AE15=N15,IF(AE14>N14,1,IF(AE14=N14,0.5,))))))","v":0.5}]
[null,null,null,null,null,{"$f":"IF(F14=\"\",\"\",IF(F14>W14,1,IF(F14=W14,0.5,0)))","v":0.5},null,{"$f":"IF(H14=\"\",\"\",IF(H14>Y14,1,IF(H14=Y14,0.5,0)))","v":0.5},null,{"$f":"IF(J14=\"\",\"\",IF(J14>AA14,1,IF(J14=AA14,0.5,0)))","v":0.5},null,{"$f":"IF(L14=\"\",\"\",IF(L14>AC14,1,IF(L14=AC14,0.5,0)))","v":0.5},null,2,null,null,null,null,null,null,null,null,{"$f":"IF(W14=\"\",\"\",IF(W14>F14,1,IF(W14=F14,0.5,0)))","v":0.5},null,{"$f":"IF(Y14=\"\",\"\",IF(Y14>H14,1,IF(Y14=H14,0.5,0)))","v":0.5},null,{"$f":"IF(AA14=\"\",\"\",IF(AA14>J14,1,IF(AA14=J14,0.5,0)))","v":0.5},null,{"$f":"IF(AC14=\"\",\"\",IF(AC14>L14,1,IF(AC14=L14,0.5,0)))","v":0.5},null,2]
[{"$f":"Eingabemaske!A15","v":0},null,"Ersatzspieler/in",null,"ab",{"$f":"Eingabemaske!E16","v":0},null,"Wurf für",null,null,{"$f":"Eingabemaske!G16","v":0},null,null,null,null,null,null,{"$f":"Eingabemaske!K15","v":0},null,"Ersatzspieler/in",null,"ab",{"$f":"Eingabemaske!O16","v":0},null,"Wurf für",null,null,{"$f":"Eingabemaske!Q16","v":0}]
[null,null,{"$f":"IF(A16=\"\",\"\",VLOOKUP(A16,'Spielerkartei - Spielbericht'!$A$452:$B$735,2))","v":{"$error":"#N/A"}},null,null,null,null,null,null,null,null,null,null,null,null,null,null,null,null,{"$f":"IF(R16=\"\",\"\",VLOOKUP(R16,'Spielerkartei - Spielbericht'!$A$452:$B$735,2))","v":{"$error":"#N/A"}}]
[]
["GESAMTLEISTUNG",null,null,{"$f":"SUM(N8,N10,N12,N14)","v":0},{"$f":"IF(L8=\"\",\"\",AVERAGE(N8,N10,N12,N14))","v":0},null,{"$f":"SUM(E8,E10,E12,E14)","v":0},null,"M - LP",null,null,null,null,null,null,{"$f":"IF(D19=0,\"\",IF(D19>U19,2,IF(D19<U19,0,IF(D19=U19,1,))))","v":""},null,"GESAMTLEISTUNG",null,null,{"$f":"SUM(AE8,AE10,AE12,AE14)","v":0},{"$f":"IF(AC8=\"\",\"\",AVERAGE(AE8,AE10,AE12,AE14))","v":0},null,{"$f":"SUM(V8,V10,V12,V14)","v":0},null,"M - LP",null,null,null,null,null,null,{"$f":"IF(U19=0,\"\",IF(U19>D19,2,IF(U19<D19,0,IF(U19=D19,1,))))","v":""}]
[null,null,null,"Kegel","Schnitt",null,"FW",null,null,null,null,null,null,null,null,null,null,null,null,null,"Kegel","Schnitt",null,"FW"]
[]
[null,null,null,null,null,null,null,null,null,{"$f":"IF(D19=U19,AH22&\" \"&0&\" Holz\",IF(D19<U19,\"\",IF(D19>U19,\"+ \"&D19-U19&\" Holz\")))","v":"± 0 Holz"},null,null,null,null,{"$f":"SUM(N9,N11,N13,N15)","v":8},null,null,{"$f":"SUM(AE9,AE11,AE13,AE15)","v":8},null,{"$f":"IF(U19=D19,AH22&\" \"&0&\" Holz\",IF(U19<D19,\"\",IF(U19>D19,\"+ \"&U19-D19&\" Holz\")))","v":"± 0 Holz"},null,null,null,null,null,null,null,null,null,null,null,null,null,"±"]
[null,null,null,null,null,null,null,null,null,null,null,null,null,null,null,null,"SATZPUNKTE"]
["HEIMVEREIN",null,null,null,null,null,null,null,null,null,null,null,null,null,{"$f":"SUM(P8,P10,P12,P14,P19)","v":2},null,null,{"$f":"SUM(AG8,AG10,AG12,AG14,AG19)","v":2},null,null,"GASTVEREIN"]
[]
[null,null,null,null,null,null,null,null,null,null,null,null,null,null,null,null,"MANNSCHAFTSPUNKTE"]
["SPORTKAPITÄN",null,null,null,null,null,null,null,null,null,null,null,null,null,null,null,null,null,null,null,"SPORTKAPITÄN"]
[null,null,null,null,18,null,null,null,null,null,null,null,null,null,{"$f":"IF(O24>R24,2,IF(R24>O24,0,IF(O24=R24,1)))","v":1},null,null,{"$f":"IF(O24<R24,2,IF(R24<O24,0,IF(O24=R24,1)))","v":1},null,null,null,null,null,null,null,null,null,null,null,null,"HV",null,"GV"]
[null,null,null,null,null,null,null,null,null,null,null,null,null,null,null,null,null,null,null,null,null,null,null,null,null,"VERWARNUNG"]
["SCHIEDSRICHTER - N A M E",null,null,null,"LV",null,"NR",null,null,null,null,null,null,null,null,null,"TABELLENPUNKTE",null,null,"SCHIEDSRICHTER",null,null,null,null,null,"PROTEST"]
["Begründung Verwarnung:"]
[]
[]
[]
[null,null,null,null,null,null,null,null,null,null,null,null,null,null,null,null,null,null,null,null,null,null,null,null,null,null,null,null,null,null,null,null,null,null,"Vereine",null,"Liga","Vereine","VereinsNr.","Bahn","Ort","Liga","Damen","Herren"]
[null,null,null,null,null,null,null,null,null,null,null,null,null,null,null,null,null,null,null,null,null,null,null,null,null,null,null,null,null,null,null,null,null,null,"D A M E N"]
[null,null,null,null,null,null,null,null,null,null,null,null,null,null,null,null,null,null,null,null,null,null,null,null,null,null,null,null,null,null,null,null,null,null,"ESV Bregenz/Wolfurt",null,null,"ATSV Hard ",106,"Freizeitzentrum Hard Bahn 5-8","Hard","Vorarlbergliga"," ","X"]
[null,null,null,null,null,null,null,null,null,null,null,null,null,null,null,null,null,null,null,null,null,null,null,null,null,null,null,null,null,null,null,null,null,null,"SKC EHG Dornbirn D 2",null,"Damenliga","ESV Bludenz 2",101,"Mokry-Bludenz Bahn 1-4","Bludenz","A - Liga"," ","X"]
[null,null,null,null,null,null,null,null,null,null,null,null,null,null,null,null,null,null,null,null,null,null,null,null,null,null,null,null,null,null,null,null,null,null,"SKC EHG Dornbirn D 3",null,"Vorarlbergliga","ESV Bregenz/Wolfurt",102,"Güterbahnhof Wolfurt Bahn 1-4","Wolfurt","Damenliga","X"," "]
[null,null,null,null,null,null,null,null,null,null,null,null,null,null,null,null,null,null,null,null,null,null,null,null,null,null,null,null,null,null,null,null,null,null,"SKC Koblach 1",null,"A - Liga","ESV Bregenz/Wolfurt 1",102,"Güterbahnhof Wolfurt Bahn 1-4","Wolfurt","Vorarlbergliga"," ","X"]
{"$rows_left_out":26}
{"sheet":"Spielerkartei - Spielbericht","index":2,"n_rows":451,"n_cols":8,"rows_kept":451,"cut":false,"hidden":false,"merged":[]}
["Pass-Nr.",null,"Ver Nr.","Verein\nName",null,"Jg","Nation"]
[1000,"KRAMMER Dominic",112,"SKC Koblach",null,"1986-05-30","AUT","M"]
[1001]
[1002,"KLINGLER Wolfgang",101,"ESV Bludenz",null,"1964-03-19","AUT","M"]
[1003,"METZLER Johann",112,"SKC Koblach",null,"1955-07-08","AUT","M"]
[1004,"SINKO Gerd",109,"SKC Illwerke",null,"1985-10-03","AUT","M"]
[1005,"WACHTER Robert",109,"SKC Illwerke",null,"1959-02-22","AUT","M"]
[1006,"NAGY Laszlo",112,"SKC Koblach",null,"1984-01-11","HUN","M"]
[1007,"FRITZ Peter",102,"ESV Bregenz Wolfurt",null,"1976-07-16","AUT","M"]
[1008]
[1009,"PESCHL Samuel",112,"SKC Koblach",null,"2005-05-10","AUT","M"]
[1010]
[1011]
[1012,"WÜSCHNER MARCEL",114,"SKC EHG Dornbirn",null,"1997-10-20","AUT","M"]
[1013,"WALTER Gottlieb",109,"SKC Illwerke",null,"1971-11-18","AUT","M"]
[1014,"EGGER Patrick",107,"SKC Hilti",null,"1992-09-19","AUT","M"]
[1015,"NIKOLIC Jan Marco",114,"SKC EHG Dornbirn",null,"2004-01-19","AUT","M"]
[1016,"FEHER Kristian",114,"SKC EHG Dornbirn",null,"1978-10-23","AUT","M"]
[1017]
[1018,"BITSCHNAU Emil",109,"SKC Illwerke",null,"1950-07-11","AUT","M"]
[1019,"KLICKOVIC Zeljko",104,"SKC Dornbirn",null,"1972-12-17","AUT","M"]
[1020,"FRITZ Erich",109,"SKC Illwerke",null,"1957-06-09","AUT","M"]
[1021,"ILES Stevan",112,"SKC Koblach",null,"1967-01-24","AUT","M"]
[1022,"Bertsch Angelo",107,"SKC Hilti",null,"2000-11-14","AUT","M"]
[1023]
[1024,"LEISSNER Günter",109,"SKC Illwerke",null,"1959-07-01","AUT","M"]
[1025,"TRATINEK Siegfried",101,"ESV Bludenz",null,"1966-08-21","AUT","M"]
[1026]
[1027,"KUSCHNY Jürgen",106,"ATSV Hard",null,"1964-07-18","AUT","M"]
[1028,"EGGER Stefan",107,"SKC Hilti",null,"1994-07-07","AUT","M"]
[1029,"VAUCE Gottfried",114,"SKC EHG Dornbirn",null,"1959-10-31","AUT","M"]
[1030,"VALENTIN Gerhard",109,"SKC Illwerke",null,"1959-06-28","AUT","M"]
[1031,"HOTTENROTT Steffen",114,"SKC EHG Dornbirn",null,"1961-07-10","GER","M"]
[1032,"SONDEREGGER Gerhard",112,"SKC Koblach",null,"1965-02-22","AUT","M"]
[1033,"SPALT Julian",112,"SKC Koblach",null,"2006-04-04","AUT","M"]
[1034,"PESCHL Stefan",113,"SKC Koblach",null,"1972-12-15","AUT","M"]
[1035,"BOLTER Ferdinand",112,"SKC Koblach",null,"1948-05-23","AUT","M"]
[1036,"KESSLER Günter",114,"SKC EHG Dornbirn",null,"1964-08-29","AUT","M"]
[1037,"BOTTESI Siegfried",112,"SKC Koblach",null,"1940-08-12","AUT","M"]
[1038,"TUSCH Norbert",112,"SKC Koblach",null,"1959-09-23","AUT","M"]
{"$rows_left_out":411}